Ticket #1521: mylog

File mylog, 16.0 KB (added by sergz, 6 years ago)
Line 
1third_party/gyp/gyp --depth=. -f make -I common.gypi --generator-output=build -Dtarget_arch=x64 libadblockplus.gyp
2make -C build
3make[1]: Entering directory `/home/sergz/projects/eyeo/libadblockplus/build'
4  CXX(target) out/Debug/obj.target/v8_base/third_party/v8/src/accessors.o
5In file included from ../third_party/v8/src/v8globals.h:32:0,
6                 from ../third_party/v8/src/v8.h:53,
7                 from ../third_party/v8/src/accessors.cc:28:
8../third_party/v8/src/v8utils.h: In function ‘void v8::internal::CopyWords(T*, T*, int)’:
9../third_party/v8/src/checks.h:251:22: error: typedef ‘__StaticAssertTypedef__128’ locally defined but not used [-Werror=unused-local-typedefs]
10     SEMI_STATIC_JOIN(__StaticAssertTypedef__, __LINE__)
11                      ^
12../third_party/v8/src/checks.h:241:39: note: in definition of macro ‘SEMI_STATIC_JOIN_HELPER’
13 #define SEMI_STATIC_JOIN_HELPER(a, b) a##b
14                                       ^
15../third_party/v8/src/checks.h:251:5: note: in expansion of macro ‘SEMI_STATIC_JOIN’
16     SEMI_STATIC_JOIN(__StaticAssertTypedef__, __LINE__)
17     ^
18../third_party/v8/src/checks.h:283:30: note: in expansion of macro ‘STATIC_CHECK’
19 #define STATIC_ASSERT(test)  STATIC_CHECK(test)
20                              ^
21../third_party/v8/src/v8utils.h:128:3: note: in expansion of macro ‘STATIC_ASSERT’
22   STATIC_ASSERT(sizeof(T) == kPointerSize);
23   ^
24../third_party/v8/src/objects.h: In member function ‘bool v8::internal::Map::CanTransition()’:
25../third_party/v8/src/checks.h:251:22: error: typedef ‘__StaticAssertTypedef__5323’ locally defined but not used [-Werror=unused-local-typedefs]
26     SEMI_STATIC_JOIN(__StaticAssertTypedef__, __LINE__)
27                      ^
28../third_party/v8/src/checks.h:241:39: note: in definition of macro ‘SEMI_STATIC_JOIN_HELPER’
29 #define SEMI_STATIC_JOIN_HELPER(a, b) a##b
30                                       ^
31../third_party/v8/src/checks.h:251:5: note: in expansion of macro ‘SEMI_STATIC_JOIN’
32     SEMI_STATIC_JOIN(__StaticAssertTypedef__, __LINE__)
33     ^
34../third_party/v8/src/checks.h:283:30: note: in expansion of macro ‘STATIC_CHECK’
35 #define STATIC_ASSERT(test)  STATIC_CHECK(test)
36                              ^
37../third_party/v8/src/objects.h:5323:5: note: in expansion of macro ‘STATIC_ASSERT’
38     STATIC_ASSERT(LAST_TYPE == LAST_JS_OBJECT_TYPE);
39     ^
40../third_party/v8/src/objects-visiting.h: In member function ‘void v8::internal::VisitorDispatchTable<Callback>::RegisterSpecializations()’:
41../third_party/v8/src/checks.h:251:22: error: typedef ‘__StaticAssertTypedef__188’ locally defined but not used [-Werror=unused-local-typedefs]
42     SEMI_STATIC_JOIN(__StaticAssertTypedef__, __LINE__)
43                      ^
44../third_party/v8/src/checks.h:241:39: note: in definition of macro ‘SEMI_STATIC_JOIN_HELPER’
45 #define SEMI_STATIC_JOIN_HELPER(a, b) a##b
46                                       ^
47../third_party/v8/src/checks.h:251:5: note: in expansion of macro ‘SEMI_STATIC_JOIN’
48     SEMI_STATIC_JOIN(__StaticAssertTypedef__, __LINE__)
49     ^
50../third_party/v8/src/checks.h:283:30: note: in expansion of macro ‘STATIC_CHECK’
51 #define STATIC_ASSERT(test)  STATIC_CHECK(test)
52                              ^
53../third_party/v8/src/objects-visiting.h:187:5: note: in expansion of macro ‘STATIC_ASSERT’
54     STATIC_ASSERT(
55     ^
56../third_party/v8/src/scanner.h: In member function ‘void v8::internal::Scanner::Init()’:
57../third_party/v8/src/checks.h:251:22: error: typedef ‘__StaticAssertTypedef__444’ locally defined but not used [-Werror=unused-local-typedefs]
58     SEMI_STATIC_JOIN(__StaticAssertTypedef__, __LINE__)
59                      ^
60../third_party/v8/src/checks.h:241:39: note: in definition of macro ‘SEMI_STATIC_JOIN_HELPER’
61 #define SEMI_STATIC_JOIN_HELPER(a, b) a##b
62                                       ^
63../third_party/v8/src/checks.h:251:5: note: in expansion of macro ‘SEMI_STATIC_JOIN’
64     SEMI_STATIC_JOIN(__StaticAssertTypedef__, __LINE__)
65     ^
66../third_party/v8/src/checks.h:283:30: note: in expansion of macro ‘STATIC_CHECK’
67 #define STATIC_ASSERT(test)  STATIC_CHECK(test)
68                              ^
69../third_party/v8/src/scanner.h:444:5: note: in expansion of macro ‘STATIC_ASSERT’
70     STATIC_ASSERT(kCharacterLookaheadBufferSize == 1);
71     ^
72../third_party/v8/src/objects-inl.h: In member function ‘bool v8::internal::Object::IsInternalizedString()’:
73../third_party/v8/src/checks.h:251:22: error: typedef ‘__StaticAssertTypedef__224’ locally defined but not used [-Werror=unused-local-typedefs]
74     SEMI_STATIC_JOIN(__StaticAssertTypedef__, __LINE__)
75                      ^
76../third_party/v8/src/checks.h:241:39: note: in definition of macro ‘SEMI_STATIC_JOIN_HELPER’
77 #define SEMI_STATIC_JOIN_HELPER(a, b) a##b
78                                       ^
79../third_party/v8/src/checks.h:251:5: note: in expansion of macro ‘SEMI_STATIC_JOIN’
80     SEMI_STATIC_JOIN(__StaticAssertTypedef__, __LINE__)
81     ^
82../third_party/v8/src/checks.h:283:30: note: in expansion of macro ‘STATIC_CHECK’
83 #define STATIC_ASSERT(test)  STATIC_CHECK(test)
84                              ^
85../third_party/v8/src/objects-inl.h:224:3: note: in expansion of macro ‘STATIC_ASSERT’
86   STATIC_ASSERT(kInternalizedTag != 0);
87   ^
88../third_party/v8/src/objects-inl.h: In member function ‘bool v8::internal::StringShape::IsInternalized()’:
89../third_party/v8/src/checks.h:251:22: error: typedef ‘__StaticAssertTypedef__309’ locally defined but not used [-Werror=unused-local-typedefs]
90     SEMI_STATIC_JOIN(__StaticAssertTypedef__, __LINE__)
91                      ^
92../third_party/v8/src/checks.h:241:39: note: in definition of macro ‘SEMI_STATIC_JOIN_HELPER’
93 #define SEMI_STATIC_JOIN_HELPER(a, b) a##b
94                                       ^
95../third_party/v8/src/checks.h:251:5: note: in expansion of macro ‘SEMI_STATIC_JOIN’
96     SEMI_STATIC_JOIN(__StaticAssertTypedef__, __LINE__)
97     ^
98../third_party/v8/src/checks.h:283:30: note: in expansion of macro ‘STATIC_CHECK’
99 #define STATIC_ASSERT(test)  STATIC_CHECK(test)
100                              ^
101../third_party/v8/src/objects-inl.h:309:3: note: in expansion of macro ‘STATIC_ASSERT’
102   STATIC_ASSERT(kInternalizedTag != 0);
103   ^
104../third_party/v8/src/objects-inl.h: In member function ‘bool v8::internal::String::IsOneByteRepresentationUnderneath()’:
105../third_party/v8/src/checks.h:251:22: error: typedef ‘__StaticAssertTypedef__328’ locally defined but not used [-Werror=unused-local-typedefs]
106     SEMI_STATIC_JOIN(__StaticAssertTypedef__, __LINE__)
107                      ^
108../third_party/v8/src/checks.h:241:39: note: in definition of macro ‘SEMI_STATIC_JOIN_HELPER’
109 #define SEMI_STATIC_JOIN_HELPER(a, b) a##b
110                                       ^
111../third_party/v8/src/checks.h:251:5: note: in expansion of macro ‘SEMI_STATIC_JOIN’
112     SEMI_STATIC_JOIN(__StaticAssertTypedef__, __LINE__)
113     ^
114../third_party/v8/src/checks.h:283:30: note: in expansion of macro ‘STATIC_CHECK’
115 #define STATIC_ASSERT(test)  STATIC_CHECK(test)
116                              ^
117../third_party/v8/src/objects-inl.h:328:3: note: in expansion of macro ‘STATIC_ASSERT’
118   STATIC_ASSERT(kIsIndirectStringTag != 0);
119   ^
120../third_party/v8/src/checks.h:251:22: error: typedef ‘__StaticAssertTypedef__329’ locally defined but not used [-Werror=unused-local-typedefs]
121     SEMI_STATIC_JOIN(__StaticAssertTypedef__, __LINE__)
122                      ^
123../third_party/v8/src/checks.h:241:39: note: in definition of macro ‘SEMI_STATIC_JOIN_HELPER’
124 #define SEMI_STATIC_JOIN_HELPER(a, b) a##b
125                                       ^
126../third_party/v8/src/checks.h:251:5: note: in expansion of macro ‘SEMI_STATIC_JOIN’
127     SEMI_STATIC_JOIN(__StaticAssertTypedef__, __LINE__)
128     ^
129../third_party/v8/src/checks.h:283:30: note: in expansion of macro ‘STATIC_CHECK’
130 #define STATIC_ASSERT(test)  STATIC_CHECK(test)
131                              ^
132../third_party/v8/src/objects-inl.h:329:3: note: in expansion of macro ‘STATIC_ASSERT’
133   STATIC_ASSERT((kIsIndirectStringMask & kStringEncodingMask) == 0);
134   ^
135../third_party/v8/src/objects-inl.h: In member function ‘bool v8::internal::String::IsTwoByteRepresentationUnderneath()’:
136../third_party/v8/src/checks.h:251:22: error: typedef ‘__StaticAssertTypedef__344’ locally defined but not used [-Werror=unused-local-typedefs]
137     SEMI_STATIC_JOIN(__StaticAssertTypedef__, __LINE__)
138                      ^
139../third_party/v8/src/checks.h:241:39: note: in definition of macro ‘SEMI_STATIC_JOIN_HELPER’
140 #define SEMI_STATIC_JOIN_HELPER(a, b) a##b
141                                       ^
142../third_party/v8/src/checks.h:251:5: note: in expansion of macro ‘SEMI_STATIC_JOIN’
143     SEMI_STATIC_JOIN(__StaticAssertTypedef__, __LINE__)
144     ^
145../third_party/v8/src/checks.h:283:30: note: in expansion of macro ‘STATIC_CHECK’
146 #define STATIC_ASSERT(test)  STATIC_CHECK(test)
147                              ^
148../third_party/v8/src/objects-inl.h:344:3: note: in expansion of macro ‘STATIC_ASSERT’
149   STATIC_ASSERT(kIsIndirectStringTag != 0);
150   ^
151../third_party/v8/src/checks.h:251:22: error: typedef ‘__StaticAssertTypedef__345’ locally defined but not used [-Werror=unused-local-typedefs]
152     SEMI_STATIC_JOIN(__StaticAssertTypedef__, __LINE__)
153                      ^
154../third_party/v8/src/checks.h:241:39: note: in definition of macro ‘SEMI_STATIC_JOIN_HELPER’
155 #define SEMI_STATIC_JOIN_HELPER(a, b) a##b
156                                       ^
157../third_party/v8/src/checks.h:251:5: note: in expansion of macro ‘SEMI_STATIC_JOIN’
158     SEMI_STATIC_JOIN(__StaticAssertTypedef__, __LINE__)
159     ^
160../third_party/v8/src/checks.h:283:30: note: in expansion of macro ‘STATIC_CHECK’
161 #define STATIC_ASSERT(test)  STATIC_CHECK(test)
162                              ^
163../third_party/v8/src/objects-inl.h:345:3: note: in expansion of macro ‘STATIC_ASSERT’
164   STATIC_ASSERT((kIsIndirectStringMask & kStringEncodingMask) == 0);
165   ^
166../third_party/v8/src/objects-inl.h: In member function ‘bool v8::internal::Object::IsJSReceiver()’:
167../third_party/v8/src/checks.h:251:22: error: typedef ‘__StaticAssertTypedef__536’ locally defined but not used [-Werror=unused-local-typedefs]
168     SEMI_STATIC_JOIN(__StaticAssertTypedef__, __LINE__)
169                      ^
170../third_party/v8/src/checks.h:241:39: note: in definition of macro ‘SEMI_STATIC_JOIN_HELPER’
171 #define SEMI_STATIC_JOIN_HELPER(a, b) a##b
172                                       ^
173../third_party/v8/src/checks.h:251:5: note: in expansion of macro ‘SEMI_STATIC_JOIN’
174     SEMI_STATIC_JOIN(__StaticAssertTypedef__, __LINE__)
175     ^
176../third_party/v8/src/checks.h:283:30: note: in expansion of macro ‘STATIC_CHECK’
177 #define STATIC_ASSERT(test)  STATIC_CHECK(test)
178                              ^
179../third_party/v8/src/objects-inl.h:536:3: note: in expansion of macro ‘STATIC_ASSERT’
180   STATIC_ASSERT(LAST_JS_RECEIVER_TYPE == LAST_TYPE);
181   ^
182../third_party/v8/src/objects-inl.h: In member function ‘bool v8::internal::Object::IsJSObject()’:
183../third_party/v8/src/checks.h:251:22: error: typedef ‘__StaticAssertTypedef__543’ locally defined but not used [-Werror=unused-local-typedefs]
184     SEMI_STATIC_JOIN(__StaticAssertTypedef__, __LINE__)
185                      ^
186../third_party/v8/src/checks.h:241:39: note: in definition of macro ‘SEMI_STATIC_JOIN_HELPER’
187 #define SEMI_STATIC_JOIN_HELPER(a, b) a##b
188                                       ^
189../third_party/v8/src/checks.h:251:5: note: in expansion of macro ‘SEMI_STATIC_JOIN’
190     SEMI_STATIC_JOIN(__StaticAssertTypedef__, __LINE__)
191     ^
192../third_party/v8/src/checks.h:283:30: note: in expansion of macro ‘STATIC_CHECK’
193 #define STATIC_ASSERT(test)  STATIC_CHECK(test)
194                              ^
195../third_party/v8/src/objects-inl.h:543:3: note: in expansion of macro ‘STATIC_ASSERT’
196   STATIC_ASSERT(LAST_JS_OBJECT_TYPE == LAST_TYPE);
197   ^
198../third_party/v8/src/objects-inl.h: In member function ‘v8::internal::String* v8::internal::String::GetUnderlying()’:
199../third_party/v8/src/checks.h:251:22: error: typedef ‘__StaticAssertTypedef__2585’ locally defined but not used [-Werror=unused-local-typedefs]
200     SEMI_STATIC_JOIN(__StaticAssertTypedef__, __LINE__)
201                      ^
202../third_party/v8/src/checks.h:241:39: note: in definition of macro ‘SEMI_STATIC_JOIN_HELPER’
203 #define SEMI_STATIC_JOIN_HELPER(a, b) a##b
204                                       ^
205../third_party/v8/src/checks.h:251:5: note: in expansion of macro ‘SEMI_STATIC_JOIN’
206     SEMI_STATIC_JOIN(__StaticAssertTypedef__, __LINE__)
207     ^
208../third_party/v8/src/checks.h:283:30: note: in expansion of macro ‘STATIC_CHECK’
209 #define STATIC_ASSERT(test)  STATIC_CHECK(test)
210                              ^
211../third_party/v8/src/objects-inl.h:2585:3: note: in expansion of macro ‘STATIC_ASSERT’
212   STATIC_ASSERT(ConsString::kFirstOffset == SlicedString::kParentOffset);
213   ^
214../third_party/v8/src/objects-inl.h: In member function ‘void v8::internal::Code::set_flags(v8::internal::Code::Flags)’:
215../third_party/v8/src/checks.h:251:22: error: typedef ‘__StaticAssertTypedef__3551’ locally defined but not used [-Werror=unused-local-typedefs]
216     SEMI_STATIC_JOIN(__StaticAssertTypedef__, __LINE__)
217                      ^
218../third_party/v8/src/checks.h:241:39: note: in definition of macro ‘SEMI_STATIC_JOIN_HELPER’
219 #define SEMI_STATIC_JOIN_HELPER(a, b) a##b
220                                       ^
221../third_party/v8/src/checks.h:251:5: note: in expansion of macro ‘SEMI_STATIC_JOIN’
222     SEMI_STATIC_JOIN(__StaticAssertTypedef__, __LINE__)
223     ^
224../third_party/v8/src/checks.h:283:30: note: in expansion of macro ‘STATIC_CHECK’
225 #define STATIC_ASSERT(test)  STATIC_CHECK(test)
226                              ^
227../third_party/v8/src/objects-inl.h:3551:3: note: in expansion of macro ‘STATIC_ASSERT’
228   STATIC_ASSERT(Code::NUMBER_OF_KINDS <= KindField::kMax + 1);
229   ^
230../third_party/v8/src/api.h: In function ‘T v8::ToCData(v8::internal::Object*)’:
231../third_party/v8/src/checks.h:251:22: error: typedef ‘__StaticAssertTypedef__120’ locally defined but not used [-Werror=unused-local-typedefs]
232     SEMI_STATIC_JOIN(__StaticAssertTypedef__, __LINE__)
233                      ^
234../third_party/v8/src/checks.h:241:39: note: in definition of macro ‘SEMI_STATIC_JOIN_HELPER’
235 #define SEMI_STATIC_JOIN_HELPER(a, b) a##b
236                                       ^
237../third_party/v8/src/checks.h:251:5: note: in expansion of macro ‘SEMI_STATIC_JOIN’
238     SEMI_STATIC_JOIN(__StaticAssertTypedef__, __LINE__)
239     ^
240../third_party/v8/src/checks.h:283:30: note: in expansion of macro ‘STATIC_CHECK’
241 #define STATIC_ASSERT(test)  STATIC_CHECK(test)
242                              ^
243../third_party/v8/src/api.h:120:3: note: in expansion of macro ‘STATIC_ASSERT’
244   STATIC_ASSERT(sizeof(T) == sizeof(v8::internal::Address));
245   ^
246../third_party/v8/src/api.h: In function ‘v8::internal::Handle<v8::internal::Object> v8::FromCData(T)’:
247../third_party/v8/src/checks.h:251:22: error: typedef ‘__StaticAssertTypedef__129’ locally defined but not used [-Werror=unused-local-typedefs]
248     SEMI_STATIC_JOIN(__StaticAssertTypedef__, __LINE__)
249                      ^
250../third_party/v8/src/checks.h:241:39: note: in definition of macro ‘SEMI_STATIC_JOIN_HELPER’
251 #define SEMI_STATIC_JOIN_HELPER(a, b) a##b
252                                       ^
253../third_party/v8/src/checks.h:251:5: note: in expansion of macro ‘SEMI_STATIC_JOIN’
254     SEMI_STATIC_JOIN(__StaticAssertTypedef__, __LINE__)
255     ^
256../third_party/v8/src/checks.h:283:30: note: in expansion of macro ‘STATIC_CHECK’
257 #define STATIC_ASSERT(test)  STATIC_CHECK(test)
258                              ^
259../third_party/v8/src/api.h:129:3: note: in expansion of macro ‘STATIC_ASSERT’
260   STATIC_ASSERT(sizeof(T) == sizeof(v8::internal::Address));
261   ^
262cc1plus: all warnings being treated as errors
263make[1]: *** [out/Debug/obj.target/v8_base/third_party/v8/src/accessors.o] Error 1
264make[1]: Leaving directory `/home/sergz/projects/eyeo/libadblockplus/build'
265make: *** [all] Error 2